{"text_format":"1","workbook":"xlsx","n_sheets":3,"sheets":["Hoja1","Hoja2","Hoja3"],"not_rendered":{"charts":0,"images":0,"macros":1,"external_links":0,"defined_names":0,"comments":0,"pivot_tables":0},"unopened":[],"bounds":{"document_bytes":16777216,"sheet_cells":100000,"rows_first":2000,"rows_last":500,"rows_between":2000,"halvings":0,"cell_chars":16384,"cell_head_chars":4096},"cells_cut":0,"cells_raw":0,"read":"whole","date_system":"1900"}

{"sheet":"Hoja1","index":0,"n_rows":6,"n_cols":2,"rows_kept":6,"cut":false,"hidden":false,"merged":[]}
["http://www.danielpinero.com/aplicaciones/macro.xlsm",{"$f":"SUBSTITUTE(IF(SUBSTITUTE(SUBSTITUTE(IF(RIGHT(MyExtract(A1,3,\"F\",\"/\"),1)=\"/\",LEFT(MyExtract(A1,3,\"F\",\"/\"),LEN(MyExtract(A1,3,\"F\",\"/\"))-1),MyExtract(A1,3,\"F\",\"/\")),\"http://\",\"\",1),\"www.\",\"\",1)=\"*\",A1,SUBSTITUTE(SUBSTITUTE(IF(RIGHT(MyExtract(A1,3,\"F\",\"/\"),1)=\"/\",LEFT(MyExtract(A1,3,\"F\",\"/\"),LEN(MyExtract(A1,3,\"F\",\"/\"))-1),MyExtract(A1,3,\"F\",\"/\")),\"http://\",\"\",1),\"www.\",\"\")),\"www.\",\"\")","v":"danielpinero.com"}]
["http://danielpinero.com/index.php",{"$f":"SUBSTITUTE(IF(SUBSTITUTE(SUBSTITUTE(IF(RIGHT(MyExtract(A2,3,\"F\",\"/\"),1)=\"/\",LEFT(MyExtract(A2,3,\"F\",\"/\"),LEN(MyExtract(A2,3,\"F\",\"/\"))-1),MyExtract(A2,3,\"F\",\"/\")),\"http://\",\"\",1),\"www.\",\"\",1)=\"*\",A2,SUBSTITUTE(SUBSTITUTE(IF(RIGHT(MyExtract(A2,3,\"F\",\"/\"),1)=\"/\",LEFT(MyExtract(A2,3,\"F\",\"/\"),LEN(MyExtract(A2,3,\"F\",\"/\"))-1),MyExtract(A2,3,\"F\",\"/\")),\"http://\",\"\",1),\"www.\",\"\")),\"www.\",\"\")","v":"danielpinero.com"}]
["http://www.danielpinero.com",{"$f":"SUBSTITUTE(IF(SUBSTITUTE(SUBSTITUTE(IF(RIGHT(MyExtract(A3,3,\"F\",\"/\"),1)=\"/\",LEFT(MyExtract(A3,3,\"F\",\"/\"),LEN(MyExtract(A3,3,\"F\",\"/\"))-1),MyExtract(A3,3,\"F\",\"/\")),\"http://\",\"\",1),\"www.\",\"\",1)=\"*\",A3,SUBSTITUTE(SUBSTITUTE(IF(RIGHT(MyExtract(A3,3,\"F\",\"/\"),1)=\"/\",LEFT(MyExtract(A3,3,\"F\",\"/\"),LEN(MyExtract(A3,3,\"F\",\"/\"))-1),MyExtract(A3,3,\"F\",\"/\")),\"http://\",\"\",1),\"www.\",\"\")),\"www.\",\"\")","v":"danielpinero.com"}]
["http://danielpinero.com",{"$f":"SUBSTITUTE(IF(SUBSTITUTE(SUBSTITUTE(IF(RIGHT(MyExtract(A4,3,\"F\",\"/\"),1)=\"/\",LEFT(MyExtract(A4,3,\"F\",\"/\"),LEN(MyExtract(A4,3,\"F\",\"/\"))-1),MyExtract(A4,3,\"F\",\"/\")),\"http://\",\"\",1),\"www.\",\"\",1)=\"*\",A4,SUBSTITUTE(SUBSTITUTE(IF(RIGHT(MyExtract(A4,3,\"F\",\"/\"),1)=\"/\",LEFT(MyExtract(A4,3,\"F\",\"/\"),LEN(MyExtract(A4,3,\"F\",\"/\"))-1),MyExtract(A4,3,\"F\",\"/\")),\"http://\",\"\",1),\"www.\",\"\")),\"www.\",\"\")","v":"danielpinero.com"}]
["www.danielpinero.com",{"$f":"SUBSTITUTE(IF(SUBSTITUTE(SUBSTITUTE(IF(RIGHT(MyExtract(A5,3,\"F\",\"/\"),1)=\"/\",LEFT(MyExtract(A5,3,\"F\",\"/\"),LEN(MyExtract(A5,3,\"F\",\"/\"))-1),MyExtract(A5,3,\"F\",\"/\")),\"http://\",\"\",1),\"www.\",\"\",1)=\"*\",A5,SUBSTITUTE(SUBSTITUTE(IF(RIGHT(MyExtract(A5,3,\"F\",\"/\"),1)=\"/\",LEFT(MyExtract(A5,3,\"F\",\"/\"),LEN(MyExtract(A5,3,\"F\",\"/\"))-1),MyExtract(A5,3,\"F\",\"/\")),\"http://\",\"\",1),\"www.\",\"\")),\"www.\",\"\")","v":"danielpinero.com"}]
["danielpinero.com",{"$f":"SUBSTITUTE(IF(SUBSTITUTE(SUBSTITUTE(IF(RIGHT(MyExtract(A6,3,\"F\",\"/\"),1)=\"/\",LEFT(MyExtract(A6,3,\"F\",\"/\"),LEN(MyExtract(A6,3,\"F\",\"/\"))-1),MyExtract(A6,3,\"F\",\"/\")),\"http://\",\"\",1),\"www.\",\"\",1)=\"*\",A6,SUBSTITUTE(SUBSTITUTE(IF(RIGHT(MyExtract(A6,3,\"F\",\"/\"),1)=\"/\",LEFT(MyExtract(A6,3,\"F\",\"/\"),LEN(MyExtract(A6,3,\"F\",\"/\"))-1),MyExtract(A6,3,\"F\",\"/\")),\"http://\",\"\",1),\"www.\",\"\")),\"www.\",\"\")","v":"danielpinero.com"}]

{"sheet":"Hoja2","index":1,"n_rows":0,"n_cols":0,"rows_kept":0,"cut":false,"hidden":false,"merged":[]}

{"sheet":"Hoja3","index":2,"n_rows":0,"n_cols":0,"rows_kept":0,"cut":false,"hidden":false,"merged":[]}